{"text_format":"1","workbook":"xlsx","n_sheets":3,"sheets":["使い方","シミュレーション ","メニューデータ"],"not_rendered":{"charts":1,"images":205,"macros":1,"external_links":1,"defined_names":2,"comments":0,"pivot_tables":0},"unopened":[],"bounds":{"document_bytes":16777216,"sheet_cells":100000,"rows_first":2000,"rows_last":500,"rows_between":2000,"halvings":0,"cell_chars":16384,"cell_head_chars":4096},"cells_cut":0,"cells_raw":0,"read":"whole","date_system":"1900"}

{"sheet":"使い方","index":0,"n_rows":30,"n_cols":19,"rows_kept":30,"cut":false,"hidden":false,"merged":[[1,1,1,8],[1,11,1,16]]}
[]
[null,null,null,null,null,null,null,null,null,null,null,"シミュレーションの使い方",null,null,null,null,null,"　"]
[]
[]
[]
[]
[]
[]
[]
[]
[]
[]
[]
[null,"年齢"]
[null,"性別"]
[]
[null,"★男性は1、女性は2を"]
[null,"選択してください。"]
[]
[null,"・身体活動レベル"]
{"$rows_left_out":11}
{"sheet":"シミュレーション ","index":1,"n_rows":41,"n_cols":35,"rows_kept":41,"cut":false,"hidden":false,"merged":[[38,36,38,37],[68,25,69,25],[35,24,35,27],[36,33,36,34],[31,17,33,17],[34,17,36,17],[37,17,39,17],[25,21,30,21],[32,24,32,27],[33,24,33,27],[34,24,34,27],[4,30,5,32]]}
[]
[]
[]
[]
[]
[null,null,null,null,null,null,null,null,null,null,null,null,null,null,null,null,null,null,null,null,null,null,null,null,null,null,null,null,null,"氏名"]
[]
[null,null,null,null,null,null,null,null,null,null,null,null,null,null,null,null,null,null,null,null,null,null,"番号","個数","献立","内食価格(円)","中食価格(円)","外食価格(円)","ｴﾈﾙｷﾞｰ(kcal)","たんぱく質(g)","Ｃａ(mg)","Ｆｅ(mg)","食塩相当量(g)","脂質(g)"]
[null,null,null,null,null,null,null,null,null,null,null,null,null,null,null,null,null,null,null,null,null,null,null,null,{"$f":"IF($W9=\"\",\"\",VLOOKUP($W9,メニューデータ!$A$2:$K$102,2,FALSE))","v":""},{"$f":"IF($W9=\"\",\"\",$X9*VLOOKUP($W9,メニューデータ!$A$2:$K$102,3,FALSE))","v":""},{"$f":"IF($W9=\"\",\"\",$X9*VLOOKUP($W9,メニューデータ!$A$2:$K$102,4,FALSE))","v":""},{"$f":"IF($W9=\"\",\"\",$X9*VLOOKUP($W9,メニューデータ!$A$2:$K$102,5,FALSE))","v":""},{"$f":"IF($W9=\"\",\"\",$X9*VLOOKUP($W9,メニューデータ!$A$2:$K$102,6,FALSE))","v":""},{"$f":"IF($W9=\"\",\"\",$X9*VLOOKUP($W9,メニューデータ!$A$2:$K$102,7,FALSE))","v":""},{"$f":"IF($W9=\"\",\"\",$X9*VLOOKUP($W9,[1]メニューデータ!$A$2:$K$102,8,FALSE))","v":""},{"$f":"IF($W9=\"\",\"\",$X9*VLOOKUP($W9,メニューデータ!$A$2:$K$102,9,FALSE))","v":""},{"$f":"IF($W9=\"\",\"\",$X9*VLOOKUP($W9,メニューデータ!$A$2:$K$102,10,FALSE))","v":""},{"$f":"IF($W9=\"\",\"\",$X9*VLOOKUP($W9,メニューデータ!$A$2:$K$102,11,FALSE))","v":""}]
[null,null,null,null,{"$f":"使い方!C14&使い方!C15","v":""},null,null,null,null,null,null,null,null,null,null,null,null,null,null,null,null,null,null,null,{"$f":"IF($W10=\"\",\"\",VLOOKUP($W10,メニューデータ!$A$2:$K$102,2,FALSE))","v":""},{"$f":"IF($W10=\"\",\"\",$X10*VLOOKUP($W10,メニューデータ!$A$2:$K$102,3,FALSE))","v":""},{"$f":"IF($W10=\"\",\"\",$X10*VLOOKUP($W10,メニューデータ!$A$2:$K$102,4,FALSE))","v":""},{"$f":"IF($W10=\"\",\"\",$X10*VLOOKUP($W10,メニューデータ!$A$2:$K$102,5,FALSE))","v":""},{"$f":"IF($W10=\"\",\"\",$X10*VLOOKUP($W10,メニューデータ!$A$2:$K$102,6,FALSE))","v":""},{"$f":"IF($W10=\"\",\"\",$X10*VLOOKUP($W10,メニューデータ!$A$2:$K$102,7,FALSE))","v":""},{"$f":"IF($W10=\"\",\"\",$X10*VLOOKUP($W10,[1]メニューデータ!$A$2:$K$102,8,FALSE))","v":""},{"$f":"IF($W10=\"\",\"\",$X10*VLOOKUP($W10,メニューデータ!$A$2:$K$102,9,FALSE))","v":""},{"$f":"IF($W10=\"\",\"\",$X10*VLOOKUP($W10,メニューデータ!$A$2:$K$102,10,FALSE))","v":""},{"$f":"IF($W10=\"\",\"\",$X10*VLOOKUP($W10,メニューデータ!$A$2:$K$102,11,FALSE))","v":""}]
[null,null,null,null,{"$f":"IF(E10=\"\",\"\",VALUE(E10))","v":""},null,null,null,null,null,null,null,null,null,null,null,null,null,null,null,null,null,null,null,{"$f":"IF($W11=\"\",\"\",VLOOKUP($W11,メニューデータ!$A$2:$K$102,2,FALSE))","v":""},{"$f":"IF($W11=\"\",\"\",$X11*VLOOKUP($W11,メニューデータ!$A$2:$K$102,3,FALSE))","v":""},{"$f":"IF($W11=\"\",\"\",$X11*VLOOKUP($W11,メニューデータ!$A$2:$K$102,4,FALSE))","v":""},{"$f":"IF($W11=\"\",\"\",$X11*VLOOKUP($W11,メニューデータ!$A$2:$K$102,5,FALSE))","v":""},{"$f":"IF($W11=\"\",\"\",$X11*VLOOKUP($W11,メニューデータ!$A$2:$K$102,6,FALSE))","v":""},{"$f":"IF($W11=\"\",\"\",$X11*VLOOKUP($W11,メニューデータ!$A$2:$K$102,7,FALSE))","v":""},{"$f":"IF($W11=\"\",\"\",$X11*VLOOKUP($W11,[1]メニューデータ!$A$2:$K$102,8,FALSE))","v":""},{"$f":"IF($W11=\"\",\"\",$X11*VLOOKUP($W11,メニューデータ!$A$2:$K$102,9,FALSE))","v":""},{"$f":"IF($W11=\"\",\"\",$X11*VLOOKUP($W11,メニューデータ!$A$2:$K$102,10,FALSE))","v":""},{"$f":"IF($W11=\"\",\"\",$X11*VLOOKUP($W11,メニューデータ!$A$2:$K$102,11,FALSE))","v":""}]
[null,null,null,null,null,null,null,null,null,null,null,null,null,null,null,null,null,null,null,null,null,null,null,null,{"$f":"IF($W12=\"\",\"\",VLOOKUP($W12,メニューデータ!$A$2:$K$102,2,FALSE))","v":""},{"$f":"IF($W12=\"\",\"\",$X12*VLOOKUP($W12,メニューデータ!$A$2:$K$102,3,FALSE))","v":""},{"$f":"IF($W12=\"\",\"\",$X12*VLOOKUP($W12,メニューデータ!$A$2:$K$102,4,FALSE))","v":""},{"$f":"IF($W12=\"\",\"\",$X12*VLOOKUP($W12,メニューデータ!$A$2:$K$102,5,FALSE))","v":""},{"$f":"IF($W12=\"\",\"\",$X12*VLOOKUP($W12,メニューデータ!$A$2:$K$102,6,FALSE))","v":""},{"$f":"IF($W12=\"\",\"\",$X12*VLOOKUP($W12,メニューデータ!$A$2:$K$102,7,FALSE))","v":""},{"$f":"IF($W12=\"\",\"\",$X12*VLOOKUP($W12,[1]メニューデータ!$A$2:$K$102,8,FALSE))","v":""},{"$f":"IF($W12=\"\",\"\",$X12*VLOOKUP($W12,メニューデータ!$A$2:$K$102,9,FALSE))","v":""},{"$f":"IF($W12=\"\",\"\",$X12*VLOOKUP($W12,メニューデータ!$A$2:$K$102,10,FALSE))","v":""},{"$f":"IF($W12=\"\",\"\",$X12*VLOOKUP($W12,メニューデータ!$A$2:$K$102,11,FALSE))","v":""}]
[null,null,null,null,null,null,null,null,null,null,null,null,null,null,null,null,null,null,null,null,null,null,null,null,{"$f":"IF($W13=\"\",\"\",VLOOKUP($W13,メニューデータ!$A$2:$K$102,2,FALSE))","v":""},{"$f":"IF($W13=\"\",\"\",$X13*VLOOKUP($W13,メニューデータ!$A$2:$K$102,3,FALSE))","v":""},{"$f":"IF($W13=\"\",\"\",$X13*VLOOKUP($W13,メニューデータ!$A$2:$K$102,4,FALSE))","v":""},{"$f":"IF($W13=\"\",\"\",$X13*VLOOKUP($W13,メニューデータ!$A$2:$K$102,5,FALSE))","v":""},{"$f":"IF($W13=\"\",\"\",$X13*VLOOKUP($W13,メニューデータ!$A$2:$K$102,6,FALSE))","v":""},{"$f":"IF($W13=\"\",\"\",$X13*VLOOKUP($W13,メニューデータ!$A$2:$K$102,7,FALSE))","v":""},{"$f":"IF($W13=\"\",\"\",$X13*VLOOKUP($W13,[1]メニューデータ!$A$2:$K$102,8,FALSE))","v":""},{"$f":"IF($W13=\"\",\"\",$X13*VLOOKUP($W13,メニューデータ!$A$2:$K$102,9,FALSE))","v":""},{"$f":"IF($W13=\"\",\"\",$X13*VLOOKUP($W13,メニューデータ!$A$2:$K$102,10,FALSE))","v":""},{"$f":"IF($W13=\"\",\"\",$X13*VLOOKUP($W13,メニューデータ!$A$2:$K$102,11,FALSE))","v":""}]
[null,null,null,null,null,null,null,null,null,null,null,null,null,null,null,null,null,null,null,null,null,null,null,null,{"$f":"IF($W14=\"\",\"\",VLOOKUP($W14,メニューデータ!$A$2:$K$102,2,FALSE))","v":""},{"$f":"IF($W14=\"\",\"\",$X14*VLOOKUP($W14,メニューデータ!$A$2:$K$102,3,FALSE))","v":""},{"$f":"IF($W14=\"\",\"\",$X14*VLOOKUP($W14,メニューデータ!$A$2:$K$102,4,FALSE))","v":""},{"$f":"IF($W14=\"\",\"\",$X14*VLOOKUP($W14,メニューデータ!$A$2:$K$102,5,FALSE))","v":""},{"$f":"IF($W14=\"\",\"\",$X14*VLOOKUP($W14,メニューデータ!$A$2:$K$102,6,FALSE))","v":""},{"$f":"IF($W14=\"\",\"\",$X14*VLOOKUP($W14,メニューデータ!$A$2:$K$102,7,FALSE))","v":""},{"$f":"IF($W14=\"\",\"\",$X14*VLOOKUP($W14,[1]メニューデータ!$A$2:$K$102,8,FALSE))","v":""},{"$f":"IF($W14=\"\",\"\",$X14*VLOOKUP($W14,メニューデータ!$A$2:$K$102,9,FALSE))","v":""},{"$f":"IF($W14=\"\",\"\",$X14*VLOOKUP($W14,メニューデータ!$A$2:$K$102,10,FALSE))","v":""},{"$f":"IF($W14=\"\",\"\",$X14*VLOOKUP($W14,メニューデータ!$A$2:$K$102,11,FALSE))","v":""}]
[null,null,null,null,null,null,null,null,null,null,null,null,null,null,null,null,null,null,null,null,null,null,null,null,{"$f":"IF($W15=\"\",\"\",VLOOKUP($W15,メニューデータ!$A$2:$K$102,2,FALSE))","v":""},{"$f":"IF($W15=\"\",\"\",$X15*VLOOKUP($W15,メニューデータ!$A$2:$K$102,3,FALSE))","v":""},{"$f":"IF($W15=\"\",\"\",$X15*VLOOKUP($W15,メニューデータ!$A$2:$K$102,4,FALSE))","v":""},{"$f":"IF($W15=\"\",\"\",$X15*VLOOKUP($W15,メニューデータ!$A$2:$K$102,5,FALSE))","v":""},{"$f":"IF($W15=\"\",\"\",$X15*VLOOKUP($W15,メニューデータ!$A$2:$K$102,6,FALSE))","v":""},{"$f":"IF($W15=\"\",\"\",$X15*VLOOKUP($W15,メニューデータ!$A$2:$K$102,7,FALSE))","v":""},{"$f":"IF($W15=\"\",\"\",$X15*VLOOKUP($W15,[1]メニューデータ!$A$2:$K$102,8,FALSE))","v":""},{"$f":"IF($W15=\"\",\"\",$X15*VLOOKUP($W15,メニューデータ!$A$2:$K$102,9,FALSE))","v":""},{"$f":"IF($W15=\"\",\"\",$X15*VLOOKUP($W15,メニューデータ!$A$2:$K$102,10,FALSE))","v":""},{"$f":"IF($W15=\"\",\"\",$X15*VLOOKUP($W15,メニューデータ!$A$2:$K$102,11,FALSE))","v":""}]
[null,null,null,null,null,null,null,null,null,null,null,null,null,null,null,null,null,null,null,null,null,null,null,null,{"$f":"IF($W16=\"\",\"\",VLOOKUP($W16,メニューデータ!$A$2:$K$102,2,FALSE))","v":""},{"$f":"IF($W16=\"\",\"\",$X16*VLOOKUP($W16,メニューデータ!$A$2:$K$102,3,FALSE))","v":""},{"$f":"IF($W16=\"\",\"\",$X16*VLOOKUP($W16,メニューデータ!$A$2:$K$102,4,FALSE))","v":""},{"$f":"IF($W16=\"\",\"\",$X16*VLOOKUP($W16,メニューデータ!$A$2:$K$102,5,FALSE))","v":""},{"$f":"IF($W16=\"\",\"\",$X16*VLOOKUP($W16,メニューデータ!$A$2:$K$102,6,FALSE))","v":""},{"$f":"IF($W16=\"\",\"\",$X16*VLOOKUP($W16,メニューデータ!$A$2:$K$102,7,FALSE))","v":""},{"$f":"IF($W16=\"\",\"\",$X16*VLOOKUP($W16,[1]メニューデータ!$A$2:$K$102,8,FALSE))","v":""},{"$f":"IF($W16=\"\",\"\",$X16*VLOOKUP($W16,メニューデータ!$A$2:$K$102,9,FALSE))","v":""},{"$f":"IF($W16=\"\",\"\",$X16*VLOOKUP($W16,メニューデータ!$A$2:$K$102,10,FALSE))","v":""},{"$f":"IF($W16=\"\",\"\",$X16*VLOOKUP($W16,メニューデータ!$A$2:$K$102,11,FALSE))","v":""}]
[null,null,null,null,null,null,null,null,null,null,null,null,null,null,null,null,null,null,null,null,null,null,null,null,{"$f":"IF($W17=\"\",\"\",VLOOKUP($W17,メニューデータ!$A$2:$K$102,2,FALSE))","v":""},{"$f":"IF($W17=\"\",\"\",$X17*VLOOKUP($W17,メニューデータ!$A$2:$K$102,3,FALSE))","v":""},{"$f":"IF($W17=\"\",\"\",$X17*VLOOKUP($W17,メニューデータ!$A$2:$K$102,4,FALSE))","v":""},{"$f":"IF($W17=\"\",\"\",$X17*VLOOKUP($W17,メニューデータ!$A$2:$K$102,5,FALSE))","v":""},{"$f":"IF($W17=\"\",\"\",$X17*VLOOKUP($W17,メニューデータ!$A$2:$K$102,6,FALSE))","v":""},{"$f":"IF($W17=\"\",\"\",$X17*VLOOKUP($W17,メニューデータ!$A$2:$K$102,7,FALSE))","v":""},{"$f":"IF($W17=\"\",\"\",$X17*VLOOKUP($W17,[1]メニューデータ!$A$2:$K$102,8,FALSE))","v":""},{"$f":"IF($W17=\"\",\"\",$X17*VLOOKUP($W17,メニューデータ!$A$2:$K$102,9,FALSE))","v":""},{"$f":"IF($W17=\"\",\"\",$X17*VLOOKUP($W17,メニューデータ!$A$2:$K$102,10,FALSE))","v":""},{"$f":"IF($W17=\"\",\"\",$X17*VLOOKUP($W17,メニューデータ!$A$2:$K$102,11,FALSE))","v":""}]
[null,null,null,null,null,null,null,null,null,null,null,null,null,null,null,null,null,null,null,null,null,null,null,null,{"$f":"IF($W18=\"\",\"\",VLOOKUP($W18,メニューデータ!$A$2:$K$102,2,FALSE))","v":""},{"$f":"IF($W18=\"\",\"\",$X18*VLOOKUP($W18,メニューデータ!$A$2:$K$102,3,FALSE))","v":""},{"$f":"IF($W18=\"\",\"\",$X18*VLOOKUP($W18,メニューデータ!$A$2:$K$102,4,FALSE))","v":""},{"$f":"IF($W18=\"\",\"\",$X18*VLOOKUP($W18,メニューデータ!$A$2:$K$102,5,FALSE))","v":""},{"$f":"IF($W18=\"\",\"\",$X18*VLOOKUP($W18,メニューデータ!$A$2:$K$102,6,FALSE))","v":""},{"$f":"IF($W18=\"\",\"\",$X18*VLOOKUP($W18,メニューデータ!$A$2:$K$102,7,FALSE))","v":""},{"$f":"IF($W18=\"\",\"\",$X18*VLOOKUP($W18,[1]メニューデータ!$A$2:$K$102,8,FALSE))","v":""},{"$f":"IF($W18=\"\",\"\",$X18*VLOOKUP($W18,メニューデータ!$A$2:$K$102,9,FALSE))","v":""},{"$f":"IF($W18=\"\",\"\",$X18*VLOOKUP($W18,メニューデータ!$A$2:$K$102,10,FALSE))","v":""},{"$f":"IF($W18=\"\",\"\",$X18*VLOOKUP($W18,メニューデータ!$A$2:$K$102,11,FALSE))","v":""}]
[null,null,null,null,null,null,null,null,null,null,null,null,null,null,null,null,null,null,null,null,null,null,null,null,{"$f":"IF($W19=\"\",\"\",VLOOKUP($W19,メニューデータ!$A$2:$K$102,2,FALSE))","v":""},{"$f":"IF($W19=\"\",\"\",$X19*VLOOKUP($W19,メニューデータ!$A$2:$K$102,3,FALSE))","v":""},{"$f":"IF($W19=\"\",\"\",$X19*VLOOKUP($W19,メニューデータ!$A$2:$K$102,4,FALSE))","v":""},{"$f":"IF($W19=\"\",\"\",$X19*VLOOKUP($W19,メニューデータ!$A$2:$K$102,5,FALSE))","v":""},{"$f":"IF($W19=\"\",\"\",$X19*VLOOKUP($W19,メニューデータ!$A$2:$K$102,6,FALSE))","v":""},{"$f":"IF($W19=\"\",\"\",$X19*VLOOKUP($W19,メニューデータ!$A$2:$K$102,7,FALSE))","v":""},{"$f":"IF($W19=\"\",\"\",$X19*VLOOKUP($W19,[1]メニューデータ!$A$2:$K$102,8,FALSE))","v":""},{"$f":"IF($W19=\"\",\"\",$X19*VLOOKUP($W19,メニューデータ!$A$2:$K$102,9,FALSE))","v":""},{"$f":"IF($W19=\"\",\"\",$X19*VLOOKUP($W19,メニューデータ!$A$2:$K$102,10,FALSE))","v":""},{"$f":"IF($W19=\"\",\"\",$X19*VLOOKUP($W19,メニューデータ!$A$2:$K$102,11,FALSE))","v":""}]
[null,null,null,null,null,null,null,null,null,null,null,null,null,null,null,null,null,null,null,null,null,null,null,null,{"$f":"IF($W20=\"\",\"\",VLOOKUP($W20,メニューデータ!$A$2:$K$102,2,FALSE))","v":""},{"$f":"IF($W20=\"\",\"\",$X20*VLOOKUP($W20,メニューデータ!$A$2:$K$102,3,FALSE))","v":""},{"$f":"IF($W20=\"\",\"\",$X20*VLOOKUP($W20,メニューデータ!$A$2:$K$102,4,FALSE))","v":""},{"$f":"IF($W20=\"\",\"\",$X20*VLOOKUP($W20,メニューデータ!$A$2:$K$102,5,FALSE))","v":""},{"$f":"IF($W20=\"\",\"\",$X20*VLOOKUP($W20,メニューデータ!$A$2:$K$102,6,FALSE))","v":""},{"$f":"IF($W20=\"\",\"\",$X20*VLOOKUP($W20,メニューデータ!$A$2:$K$102,7,FALSE))","v":""},{"$f":"IF($W20=\"\",\"\",$X20*VLOOKUP($W20,[1]メニューデータ!$A$2:$K$102,8,FALSE))","v":""},{"$f":"IF($W20=\"\",\"\",$X20*VLOOKUP($W20,メニューデータ!$A$2:$K$102,9,FALSE))","v":""},{"$f":"IF($W20=\"\",\"\",$X20*VLOOKUP($W20,メニューデータ!$A$2:$K$102,10,FALSE))","v":""},{"$f":"IF($W20=\"\",\"\",$X20*VLOOKUP($W20,メニューデータ!$A$2:$K$102,11,FALSE))","v":""}]
{"$rows_left_out":22}
{"sheet":"メニューデータ","index":2,"n_rows":102,"n_cols":20,"rows_kept":102,"cut":false,"hidden":false,"merged":[]}
["メニュー\nナンバー","メニュー","内食価格(円)","中食価格(円)","外食価格(円)","エネルギー\n(kcal)","たんぱく質\n(ｇ)","Ｃａ(mg)","Ｆｅ(mg)","食塩相当量(g)","脂質(g)",null,null,"食事摂取基準"]
[1,"トースト",73.44,190,190,304,8.9499999999999993,23.2,0.51,1.35,10.58,null,null,"年齢/性別","エネルギー(kcal)","たんぱく質(ｇ)","Ｃａ(mg)","Ｆｅ(mg)","食塩相当量(g)","Fe耐容上限量(mg/日)"]
[2,"ハンバーガー",150.12,220,220,371,15.31,46.14,1.3,1.74,19.25,null,null,121,2600,60,1000,10,7,40]
[3,"肉まん",57.24,124,170,242,7.51,20.89,0.59,0.52,6.15,null,null,122,2400,55,800,12,6.5,40]
[4,"おにぎり",85.320000000000007,206,405,348,8.3840000000000003,26.94,0.56000000000000005,2.65,1.7629999999999999,null,null,131,2600,60,1000,10,7,40]
[5,"ロールパン",64.800000000000011,130,200,311,10.527000000000001,67.424999999999997,0.96016666666666661,0.1245,5.9163333333333332,null,null,132,2400,55,800,12,6.5,40]
[6,"たこ焼き",140.4,315,480,278,13.75,51.57,1.01,2.72,10.309399999999998,null,null,141,2600,60,1000,10,7,40]
[7,"ピザ",270,250,399,320,13.87,127.64,1.07,0.92363333333333331,15.8,null,null,142,2400,55,800,12,6.5,40]
[8,"ご飯",29.160000000000004,121,200,250,4,4.8000000000000007,0.16000000000000003,0,0.48,null,null,151,2800,65,800,10,7.5,50]
[9,"炊き込みご飯",181.44,217,300,349,12.38,38.950000000000003,1.26,1.48,3.81,null,null,152,2300,55,650,10.5,6.5,40]
[10,"にぎり寿司",336.96000000000004,648,1040,443,19.649999999999999,32.56,0.96,2.8,5.04,null,null,161,2800,65,800,10,7.5,50]
[11,"いなりずし",76.680000000000007,178,224,446,15.349999999999998,203.04,2.16,1.99,18.306000000000001,null,null,162,2300,55,650,10.5,6.5,40]
[12,"ラーメン",253.8,428,633,413,21.38,48.12,1.59,4.8154999999999992,7.4,null,null,171,2800,65,800,10,7.5,50]
[13,"カップラーメン",108,108,300,351,10.5,105,0,4.9000000000000004,14.6,null,null,172,2300,55,650,10.5,6.5,40]
[14,"サンドイッチ",193.32000000000002,264,560,539,17.82,49.31,1.28,3.26,32.270000000000003,null,null,181,2650,65,800,7.5,7.5,50]
[15,"焼鮭弁当",208.44000000000003,488,1203,548,23.61,100.39,1.7,1.7035,14.043000000000001,null,null,182,2000,50,650,10.5,6.5,40]
[16,"カレーライス",245.16000000000003,430,555,754,22.8,50.7,1.77,3.14,26.770799999999998,null,null,191,2650,65,800,7.5,7.5,50]
[17,"親子丼",125.28,342,780,492,17.55,42.37,1.44,1.7752000000000003,10.01,null,null,192,2000,50,650,10.5,6.5,40]
[18,"カツ丼",268.92,526,864,688,27.01,47.9,1.71,2.3651,24,null,null,201,2650,65,800,7.5,7.5,50]
[19,"牛丼",362.88,377,347,515,24.430999999999997,34.369999999999997,2.95,3.37,6.15,null,null,202,2000,50,650,10.5,6.5,40]
{"$rows_left_out":82}